{"text_format":"1","workbook":"xlsx","n_sheets":14,"sheets":["Beveilig","Introductie","Algemeen","BI Organisatie","BI Expertise","BI Data-IT","BI Data Governance","BI Gebruik","BI Resultaten","BI Maturity","scores","Grafisch","Antwoorden","Toelichting Werkwijze"],"not_rendered":{"charts":3,"images":7,"macros":1,"external_links":0,"defined_names":5,"comments":1,"pivot_tables":1},"unopened":[],"bounds":{"document_bytes":16777216,"sheet_cells":100000,"rows_first":2000,"rows_last":500,"rows_between":2000,"halvings":0,"cell_chars":16384,"cell_head_chars":4096},"cells_cut":0,"cells_raw":0,"read":"whole","date_system":"1900"}

{"sheet":"Beveilig","index":0,"n_rows":15,"n_cols":6,"rows_kept":15,"cut":false,"hidden":false,"merged":[]}
[null,null,null,null,null,"Welkom bij de BI Maturity Quick scan Bij Zuiderduin.nl"]
[null,null,null,null,null,"Kies voor macro's inschakelen om de BI Quick Scan te starten."]
[]
[]
[]
[]
[]
[]
[]
[]
{"$rows_left_out":6}
{"sheet":"Introductie","index":1,"n_rows":30,"n_cols":16,"rows_kept":30,"cut":false,"hidden":true,"merged":[]}
[null,null,null,null,null,null,null,null,null,null,null,null,null,null,null,"alles ingevuld"]
[null,null,"                              Welkom bij de Business Intelligence \n                              Quick Scan BijZuiderduin!",null,null,null,null,null,null,null,null,null,null,null,null,{"$f":"P18","v":false}]
[]
[null,null,"Deze Quick scan beoogt u inzicht te geven in de BI/Data volwassenheid van uw bedrijf als geheel en enkele deelaspecten. Met dit inzicht kunt u zien of er aspecten zijn waar u beter of minder goed presteert dan gemiddeld."]
[null,null,"Als u de vragen op de volgende 7 pagina's beantwoord krijgt u het resultaat te zien. Naar verwachting kost u dat 15-30 minuten."]
[]
[null,null,"Wanneer u het resultaat opstuurt, neem ik contact op om het resultaat te bespreken. Ik geef u dan mijn visie of er aspecten zijn die minder of juist extra aandacht nodig hebben en, zo mogelijk ook, waar kansen voor u liggen."]
[null,null,"Stuur daartoe het ingevulde document naar:  "]
[null,null,"info@BijZuiderduin.nl"]
[null,null,"Uw vragen kunt u daar ook kwijt."]
{"$rows_left_out":21}
{"sheet":"Algemeen","index":2,"n_rows":29,"n_cols":17,"rows_kept":29,"cut":false,"hidden":true,"merged":[[17,3,24,3]]}
[null,null,null,"Business Intelligence Quick Scan \nBijZuiderduin",null,null,null,null,null,null,null,null,null,null,null,"Pagina volledig ingevuld"]
[null,null,"Algemene bedrijfs- en contactinformatie",null,"Voortgang",{"$f":"0/7","v":0},null,null,null,null,null,null,null,null,null,{"$f":"AND(P6:P13)","v":false}]
[]
[]
[null,null,"Algemene bedrijfsgegevens"]
[null,null,"* Datum",null,null,null,null,null,null,null,null,null,null,null,null,{"$f":"NOT(ISBLANK(D6))","v":false}]
[null,null,"* Naam organisatie",null,null,null,null,null,null,null,null,null,null,null,null,{"$f":"NOT(ISBLANK(D7))","v":false}]
[null,null,"Branche"]
[null,null,"Afdeling"]
[null,null,"* Ingevuld door",null,null,null,null,null,null,null,null,null,null,null,null,{"$f":"NOT(ISBLANK(D10))","v":false}]
{"$rows_left_out":20}
{"sheet":"BI Organisatie","index":3,"n_rows":22,"n_cols":19,"rows_kept":22,"cut":false,"hidden":true,"merged":[]}
[null,null,null,"Business Intelligence Quick Scan \nBijZuiderduin",null,null,null,null,null,null,null,null,null,null,null,"Pagina volledig ingevuld"]
[null,null,"BI Organisatie ","Voortgang",{"$f":"1/7","v":0.14285714285714285},null,null,null,null,null,null,null,null,null,null,{"$f":"AND(P8,R4)","v":false}]
["categorie",null,"vraag","mogelijke antwoorden",null,null,null,null,null,null,null,"Gewicht","note","waarde","waardering","ingevuld","resultaat","gewogen","regel"]
[null,null,null,null,null,null,null,null,null,null,null,null,null,null,null,null,null,{"$f":"(R5+R16)<>0","v":false}]
[null,null,"BI Visie","Kies een antwoord uit de pull downlijst die verschijnt als u het veld selecteert.",null,null,null,null,null,null,null,{"$f":"SUM(L6:L9)","v":120},null,null,null,null,null,{"$f":"SUM(R6:R9)","v":0}]
["Basis",null,"Hoe worden BI activiteiten geinitieerd?",null,null,null,null,null,null,null,null,40,null,null,null,null,{"$f":"VLOOKUP(D6,Antwoorden!A25:B29,2,0)","v":{"$error":"#N/A"}},{"$f":"IF(ISERROR(Q6),0,L6*Q6)","v":0}]
["Basis",null,"Hoe worden  BI ideeën opgepakt?",null,null,null,null,null,null,null,null,40,null,null,null,null,{"$f":"VLOOKUP(D7,Antwoorden!C25:D29,2,0)","v":{"$error":"#N/A"}},{"$f":"IF(ISERROR(Q7),0,L7*Q7)","v":0}]
[null,null,null,null,null,null,null,null,null,null,null,null,null,null,null,{"$f":"OR(P9:P14)","v":false}]
["Basis",null,"Wat is geldig voor de BI visie?","We hebben geen BI visie document",null,null,null,null,null,null,null,40,"Alleen laten zien als geen Nee bij vorige vraag",0,{"$f":"P9*N9","v":0},false,5,{"$f":"SUM(O9:O14)/SUM(N9:N14)*Q9*L9","v":0}]
[null,null,"(meerdere antwoorden mogelijk)","Is afgeleid van de bedrijfsstrategie",null,null,null,null,null,null,null,null,null,20,{"$f":"P10*N10","v":0},false]
{"$rows_left_out":13}
{"sheet":"BI Expertise","index":4,"n_rows":22,"n_cols":19,"rows_kept":22,"cut":false,"hidden":true,"merged":[[0,4,0,6]]}
[null,null,null,null,"Business Intelligence Quick Scan \nBijZuiderduin",null,null,null,null,null,null,null,null,null,null,"alles ingevuld"]
[null,null,"BI Expertise",null,null,null,"Voortgang",{"$f":"2/7","v":0.2857142857142857},null,null,null,{"$f":"SUM(L7:L11)","v":220},null,null,null,{"$f":"COUNTIF(P7:P11,0)=0","v":false},null,{"$f":"SUM(R7:R11)","v":0}]
["categorie",null,"vraag",null,"mogelijke antwoorden",null,null,null,null,null,null,"Gewicht","note","waarde","waardering","ingevuld","resultaat","gewogen","regel"]
[]
[]
["Basis",null,"Hoe is onderstaande BI expertise in het bedrijf beschikbaar?",null,"Niet beschikbaar","Beperkt beschikbaar","Beschikbaar maar beperkt gebruikt","Goed beschikbaar \nen gebruikt","Onbekend",null,null,{"$f":"SUM(L7:L11)","v":220},null,null,null,null,null,{"$f":"SUM(R7:R11)","v":0}]
["Basis",null,"BI Data ontsluiting en integratie",null,null,null,null,null,null,null,null,40,null,null,null,0,{"$f":"VLOOKUP(P7,$N$18:$O$22,2,0)","v":{"$error":"#N/A"}},{"$f":"IF(ISERROR(Q7),0,Q7*L7)","v":0}]
["Basis",null,"Rapportage en visualisatie",null,null,null,null,null,null,null,null,30,null,null,null,0,{"$f":"VLOOKUP(P8,$N$18:$O$22,2,0)","v":{"$error":"#N/A"}},{"$f":"IF(ISERROR(Q8),0,Q8*L8)","v":0},"als score vraag 1<3 dan vreemd als hier vraag 2>3"]
["Basis",null,"Combinatie BI en Bedrijfsproces kennis",null,null,null,null,null,null,null,null,40,null,null,null,0,{"$error":"#N/A"},0]
["Basis",null,"Data Science",null,null,null,null,null,null,null,null,60,null,null,null,0,{"$error":"#N/A"},0,"als score vraag 1<4 dan vreemd als hier vraag 4>2"]
{"$rows_left_out":13}
{"sheet":"BI Data-IT","index":5,"n_rows":20,"n_cols":19,"rows_kept":20,"cut":false,"hidden":true,"merged":[]}
[null,null,null,"Business Intelligence Quick Scan \nBijZuiderduin",null,null,null,null,null,null,null,null,null,null,null,"Pagina volledig ingevuld"]
[null,null,"BI Data-IT ","Voortgang",{"$f":"3/7","v":0.42857142857142855},null,null,null,null,null,null,null,null,null,null,{"$f":"P4=0","v":false}]
["categorie",null,"vraag","mogelijke antwoorden",null,null,null,null,null,null,null,"Gewicht","note","waarde","waardering","ingevuld","resultaat","gewogen","regel"]
[null,null,null,null,null,null,null,null,null,null,null,null,null,null,null,{"$f":"COUNTBLANK(D6:D9)+ COUNTBLANK(D12:D14)+COUNTBLANK(D17:D20)","v":11}]
[null,null,"BI data","Kies een antwoord uit de pull downlijst die verschijnt als u het veld selecteert.",null,null,null,null,null,null,null,{"$f":"SUM(L6:L9)","v":135},null,null,null,null,null,{"$f":"SUM(R6:R9)","v":0}]
["Basis",null,"Hoe wordt data voor BI gebruik ontsloten?",null,null,null,null,null,null,null,null,60,null,null,null,null,{"$f":"VLOOKUP(D6,Antwoorden!$A$4:$B$10,2,0)","v":{"$error":"#N/A"}},{"$f":"IF(ISERROR(Q6),0,L6*Q6)","v":0}]
["Basis",null,"Hoeveel historie is in de BI data beschikbaar?",null,null,null,null,null,null,null,null,25,null,null,null,null,{"$f":"VLOOKUP(D7,Antwoorden!$C$4:$D$8,2,0)","v":{"$error":"#N/A"}},{"$f":"IF(ISERROR(Q7),0,MIN($R$6,L7*Q7))","v":0},"maximaal de score op vraag 1"]
["Basis",null,"Hoe vaak wordt de BI data bijgewerkt?",null,null,null,null,null,null,null,null,25,null,null,null,null,{"$f":"VLOOKUP(D8,Antwoorden!$E$4:$F$8,2,0)","v":{"$error":"#N/A"}},{"$f":"IF(ISERROR(Q8),0,MIN($R$6,L8*Q8))","v":0},"maximaal de score op vraag 1"]
["Basis",null,"Wat is het detailniveau van de BI data?",null,null,null,null,null,null,null,null,25,null,null,null,null,{"$f":"VLOOKUP(D9,Antwoorden!$G$4:$H$8,2,0)","v":{"$error":"#N/A"}},0,"maximaal de score op vraag 1"]
[]
{"$rows_left_out":11}
{"sheet":"BI Data Governance","index":6,"n_rows":24,"n_cols":19,"rows_kept":24,"cut":false,"hidden":true,"merged":[[15,3,15,8],[10,3,10,8],[9,3,9,8],[13,3,13,8],[11,3,11,8],[0,3,0,5],[8,3,8,8],[5,3,5,8],[7,3,7,8],[14,3,14,8],[12,3,12,8],[6,3,6,8]]}
[null,null,null,"Business Intelligence Quick Scan \nBijZuiderduin",null,null,null,null,null,null,null,"Totaal gewicht",null,null,null,"Pagina volledig ingevuld",null,"Totaal gewogen"]
[null,null,"BI Data Governance",null,null,null,null,"Voortgang",{"$f":"4/7","v":0.5714285714285714},null,null,{"$f":"SUM(L4:L17)","v":380},null,null,null,{"$f":"COUNTIF(P6:P16,0)=0","v":false},null,{"$f":"SUM(R4:R17)","v":0}]
["categorie",null,"vraag","mogelijke antwoorden",null,null,null,null,null,null,null,"Gewicht","note","waarde","waardering","ingevuld","resultaat","gewogen","regel"]
[]
[null,null,"Data Governance implementatie","Geen aandacht","Beperkt geïmplementeerd","Belegd in de organisatie","Regelmatig gereviewed","KPI's worden gerapporteerd","Onbekend",null,null,{"$f":"SUM(L6:L16)","v":190},null,null,null,null,null,{"$f":"SUM(R6:R16)","v":0}]
[null,null,"Data Governance (algemeen)",null,null,null,null,null,null,null,null,20,null,null,null,0,{"$f":"VLOOKUP(P6,$N$19:$O$24,2,0)","v":{"$error":"#N/A"}},{"$f":"IF(ISERROR(Q6),0,Q6*L6)","v":0}]
[null,null,"Data architectuur",null,null,null,null,null,null,null,null,15,null,null,null,0,{"$error":"#N/A"},{"$f":"IF(ISERROR(Q7),0,Q7*L7)","v":0}]
[null,null,"Meta Data Beheer",null,null,null,null,null,null,null,null,20,null,null,null,0,{"$error":"#N/A"},0]
[null,null,"Data Quality",null,null,null,null,null,null,null,null,20,null,null,null,0,{"$error":"#N/A"},0]
[null,null,"Data opslag en Operationeel Beheer",null,null,null,null,null,null,null,null,10,null,null,null,0,{"$error":"#N/A"},0]
{"$rows_left_out":15}
{"sheet":"BI Gebruik","index":7,"n_rows":9,"n_cols":19,"rows_kept":9,"cut":false,"hidden":true,"merged":[]}
[null,null,null,"Business Intelligence Quick Scan \nBijZuiderduin",null,null,null,null,null,null,null,null,null,null,null,"Pagina volledig ingevuld"]
[null,null,"BI Gebruik ","Voortgang",{"$f":"5/7","v":0.7142857142857143},null,null,null,null,null,null,null,null,null,null,{"$f":"P4=0","v":false}]
["categorie",null,"vraag","mogelijke antwoorden",null,null,null,null,null,null,null,"Gewicht","note","waarde","waardering","ingevuld","resultaat","gewogen","regel"]
[null,null,null,null,null,null,null,null,null,null,null,{"$f":"SUM(L6:L12)","v":70},null,null,null,{"$f":"COUNTBLANK(D6:D9)","v":4},null,{"$f":"SUM(R6:R12)","v":0}]
[null,null,"Hoe wordt BI data in uw organisatie gebruikt?","Kies een antwoord uit de pull downlijst die verschijnt als u het veld selecteert."]
[null,null,"Hoe kunnen eindgebruikers informatie uit gecombineerde bronnen benaderen?",null,null,null,null,null,null,null,null,10,null,null,null,null,{"$f":"VLOOKUP(D6,Antwoorden!A16:B20,2,0)","v":{"$error":"#N/A"}},{"$f":"IF(ISERROR(Q6),0,L6*Q6)","v":0}]
[null,null,"Rapporteert de organisatie over BI KPI's?",null,null,null,null,null,null,null,null,20,null,null,null,null,{"$f":"VLOOKUP(D7,Antwoorden!C16:D20,2,0)","v":{"$error":"#N/A"}},{"$f":"IF(ISERROR(Q7),0,L7*Q7)","v":0}]
[null,null,"Hoe wordt BI data gezien?",null,null,null,null,null,null,null,null,20,null,null,null,null,{"$f":"VLOOKUP(D8,Antwoorden!E16:F20,2,0)","v":{"$error":"#N/A"}},0]
[null,null,"Wat wordt er met BI analyse resultaten gedaan?",null,null,null,null,null,null,null,null,20,null,null,null,null,{"$f":"VLOOKUP(D9,Antwoorden!G16:H20,2,0)","v":{"$error":"#N/A"}},0]

{"sheet":"BI Resultaten","index":8,"n_rows":29,"n_cols":19,"rows_kept":29,"cut":false,"hidden":true,"merged":[[0,3,0,5]]}
[null,null,null,"Business Intelligence Quick Scan \nBijZuiderduin",null,null,null,null,null,null,null,null,null,null,null,"Pagina volledig ingevuld"]
[null,null,"BI Resultaten ",null,null,null,"Voortgang",{"$f":"6/7","v":0.8571428571428571},null,null,null,null,null,null,null,{"$f":"COUNTIF(P6:P28,0)=0","v":false}]
["categorie",null,"vraag","mogelijke antwoorden",null,null,null,null,null,null,null,"Gewicht","note","waarde","waardering","ingevuld","resultaat","gewogen","regel"]
[]
[null,null,"Voor welke doeleinden wordt BI ingezet","Niet","Zeer beperkt","Matig","Uitgebreid","Onbekend/nvt",null,null,null,{"$f":"SUM(L6:L12)","v":140},null,null,null,null,null,{"$f":"SUM(R6:R12)","v":0}]
[null,null,"Verantwoordings rapportages",null,null,null,null,null,null,null,null,20,null,null,null,0,{"$f":"VLOOKUP(P6,$N$21:$O$26,2,0)","v":{"$error":"#N/A"}},{"$f":"IF(ISERROR(Q6),0,Q6*L6)","v":0}]
[null,null,"Verbeteren besluitvorming",null,null,null,null,null,null,null,null,20,null,null,null,0,{"$error":"#N/A"},{"$f":"IF(ISERROR(Q7),0,Q7*L7)","v":0}]
[null,null,"Verhogen inkomsten/omzet",null,null,null,null,null,null,null,null,20,null,null,null,0,{"$error":"#N/A"},{"$f":"IF(ISERROR(Q8),0,Q8*L8)","v":0}]
[null,null,"Verhogen klanttevredenheid",null,null,null,null,null,null,null,null,20,null,null,null,0,{"$error":"#N/A"},{"$f":"IF(ISERROR(Q9),0,Q9*L9)","v":0}]
[null,null,"Voldoen aan regelgeving ",null,null,null,null,"*",null,null,null,{"$f":"IF(P10=5,0,M10)","v":20},20,null,null,0,{"$error":"#N/A"},0]
{"$rows_left_out":20}
{"sheet":"BI Maturity","index":9,"n_rows":38,"n_cols":24,"rows_kept":38,"cut":false,"hidden":true,"merged":[[0,3,0,5]]}
[null,null,null,"Business Intelligence Quick Scan \nBijZuiderduin"]
[null,null,"BI Maturity "]
[]
[]
[null,null,null,null,null,null,null,null,null,null,null,null,null,null,null,null,"score","gewicht","Deelscore","min","max","totale","Ambitie"]
[null,null,null,null,null,null,null,null,null,null,null,null,null,null,"totale",null,{"$f":"SUM(Q7:Q9)","v":0},{"$f":"SUM(R7:R9)","v":1500},{"$f":"Q6/R6","v":0},null,null,{"$f":"$S$6","v":0},{"$f":"$S$10","v":0}]
[null,null,"Voorspellen",null,null,null,null,null,null,null,null,null,null,null,"Organisatie",null,{"$f":"SUM(Q12:Q14)","v":0},{"$f":"SUM(R12:R14)","v":500},{"$f":"Q7/R7","v":0},{"$f":"MIN(S12:S14)","v":0},{"$f":"MAX(S12:S14)-T7","v":0},{"$f":"$S$6","v":0},{"$f":"$S$10","v":0},"Organisatie"]
[null,null,null,null,null,null,null,null,null,null,null,null,null,null,"Data en IT",null,{"$f":"SUM(Q15:Q18)","v":0},{"$f":"SUM(R15:R18)","v":500},{"$f":"Q8/R8","v":0},{"$f":"MIN(S15:S18)","v":0},{"$f":"MAX(S15:S18)-T8","v":0},{"$f":"$S$6","v":0},{"$f":"$S$10","v":0},"Data en IT"]
[null,null,"Analyseren",null,null,null,null,null,null,null,null,null,null,null,"Toepassing",null,{"$f":"SUM(Q19:Q23)","v":0},{"$f":"SUM(R19:R23)","v":500},{"$f":"Q9/R9","v":0},{"$f":"MIN(S19:S23)","v":0},{"$f":"MAX(S19:S23)-T9","v":0},0,0,"Toepassing"]
[null,null,null,null,null,null,null,null,null,null,null,null,null,null,"Ambitie",null,null,null,{"$f":"'BI Organisatie'!R22","v":0}]
{"$rows_left_out":29}
{"sheet":"scores","index":10,"n_rows":59,"n_cols":8,"rows_kept":59,"cut":false,"hidden":true,"merged":[]}
["Naam organisatie","Ingevuld door","Aspect","Deelaspect","vraag","gewicht","score","ambitie"]
[{"$f":"Algemeen!$D$7","v":0},{"$f":"Algemeen!$D$10","v":0},{"$f":"'BI Organisatie'!$C$2","v":"BI Organisatie "},{"$f":"'BI Organisatie'!$C$5","v":"BI Visie"},{"$f":"'BI Organisatie'!C6","v":"Hoe worden BI activiteiten geinitieerd?"},{"$f":"'BI Organisatie'!L6","v":40},{"$f":"'BI Organisatie'!R6","v":0},{"$f":"$G$9","v":0}]
[{"$f":"Algemeen!$D$7","v":0},{"$f":"Algemeen!$D$10","v":0},{"$f":"'BI Organisatie'!$C$2","v":"BI Organisatie "},{"$f":"'BI Organisatie'!$C$5","v":"BI Visie"},{"$f":"'BI Organisatie'!C7","v":"Hoe worden  BI ideeën opgepakt?"},{"$f":"'BI Organisatie'!L7","v":40},{"$f":"'BI Organisatie'!R7","v":0},0]
[{"$f":"Algemeen!$D$7","v":0},{"$f":"Algemeen!$D$10","v":0},{"$f":"'BI Organisatie'!$C$2","v":"BI Organisatie "},{"$f":"'BI Organisatie'!$C$5","v":"BI Visie"},{"$f":"'BI Organisatie'!C9","v":"Wat is geldig voor de BI visie?"},{"$f":"'BI Organisatie'!L9","v":40},{"$f":"'BI Organisatie'!R9","v":0},0]
[{"$f":"Algemeen!$D$7","v":0},{"$f":"Algemeen!$D$10","v":0},{"$f":"'BI Organisatie'!$C$2","v":"BI Organisatie "},{"$f":"'BI Organisatie'!$C$16","v":"Organisatie"},{"$f":"'BI Organisatie'!C17","v":"Wie is eindverantwoordelijk voor BI?"},{"$f":"'BI Organisatie'!L17","v":40},{"$f":"'BI Organisatie'!R17","v":0},0]
[{"$f":"Algemeen!$D$7","v":0},{"$f":"Algemeen!$D$10","v":0},{"$f":"'BI Organisatie'!$C$2","v":"BI Organisatie "},{"$f":"'BI Organisatie'!$C$16","v":"Organisatie"},{"$f":"'BI Organisatie'!C18","v":"Wie maken er gebruik van BI data?"},{"$f":"'BI Organisatie'!L18","v":40},{"$f":"'BI Organisatie'!R18","v":0},0]
[{"$f":"Algemeen!$D$7","v":0},{"$f":"Algemeen!$D$10","v":0},{"$f":"'BI Organisatie'!$C$2","v":"BI Organisatie "},{"$f":"'BI Organisatie'!$C$16","v":"Organisatie"},{"$f":"'BI Organisatie'!C19","v":"Hoe zijn BI werkzaamheden georganiseerd?"},{"$f":"'BI Organisatie'!L19","v":40},{"$f":"'BI Organisatie'!R19","v":0},0]
[{"$f":"Algemeen!$D$7","v":0},{"$f":"Algemeen!$D$10","v":0},{"$f":"'BI Organisatie'!$C$2","v":"BI Organisatie "},{"$f":"'BI Organisatie'!$C$16","v":"Organisatie"},{"$f":"'BI Organisatie'!C20","v":"Wat is het niveau van BI kennis en cultuur?"},{"$f":"'BI Organisatie'!L20","v":40},{"$f":"'BI Organisatie'!R20","v":0},0]
[{"$f":"Algemeen!$D$7","v":0},{"$f":"Algemeen!$D$10","v":0},"Ambitie","Ambitie",{"$f":"'BI Organisatie'!C22","v":"Wat is uw ambitie over 1-2 jaar"},0,{"$f":"'BI Organisatie'!R22","v":0},0]
[{"$f":"Algemeen!$D$7","v":0},{"$f":"Algemeen!$D$10","v":0},{"$f":"'BI Organisatie'!$C$2","v":"BI Organisatie "},"BI Expertise","BI Data integratie en ontsluiting",{"$f":"'BI Expertise'!L7","v":40},{"$f":"'BI Expertise'!R7","v":0},0]
{"$rows_left_out":50}
{"sheet":"Grafisch","index":11,"n_rows":79,"n_cols":5,"rows_kept":79,"cut":false,"hidden":true,"merged":[]}
[null,null,"Rijlabels","Som van ambitie","Som van gewogen score"]
[null,null,"BI Data-IT ",0,0]
[null,null,"BI data",0,0]
[null,null,"Hoe wordt data voor BI gebruik ontsloten?",0,0]
[null,null,"Hoeveel historie is in de BI data beschikbaar?",0,0]
[null,null,"Hoe vaak wordt de BI data bijgewerkt?",0,0]
[null,null,"Wat is het detailniveau van de BI data?",0,0]
[null,null,"BI data Beheer",0,0]
[null,null,"Hoe vaak zijn er incidenten in de verwerking?",0,0]
[null,null,"Hoe snel kunnen wijzigingen in de datastromen verwerkt worden?",0,0]
{"$rows_left_out":70}
{"sheet":"Antwoorden","index":12,"n_rows":67,"n_cols":22,"rows_kept":67,"cut":false,"hidden":true,"merged":[]}
["Data vragen"]
["Hoe wordt data voor BI gebruik ontsloten",null,"Hoeveel historie is in de BI data beschikbaar",null,"Hoe vaak wordt de BI data bijgewerkt",null,"Wat is het detailniveau van de BI data",null,"Uit hoeveel bedrijfsbronnen is data beschikbaar",null,"Hoe wordt data uit externe databronnen ontsloten",null,"Hoe snel kan een verzoek, om gecombineerde data uit meerdere basis systemen te leveren, worden gerealiseerd?",null,"Hoe vaak zijn er incidenten in de verwerking",null,"Hoe snel kunnen wijzigingen in de datastromen verwerkt worden",null,"Voldoet de huidige informatievoorziening",null,"Hoe snel kunnen BI analyse resultaten in de praktijk worden toegepast (bv. bij klantcontacten)"]
[]
["Data wordt niet ontsloten",1,"Geen",1,"Real time",5,"Geen BI data",1,"0-10%",1,"We gebruiken geen externe data",1,"<1 dag",5,"(Bijna) nooit",5,"1 dag",5,"0-10% van de vragen",1,"We passen geen BI resultaten toe",1]
["Op ad hoc basis",1.25,"Minstens 1 maand",2,"Minstens iedere 4 uur",4,"Enkele kenmerken geaggregeerd",1.5,"10-25%",2,"Externe data wordt op ad hoc basis gebruikt",3,"1 dag",4,"Enkele keren per jaar kleine incidenten",4,"< 1 week",4,"10-25% van de vragen",2,"Na de analyse wordt gekeken hoe dit geïmplementeerd kan worden",2]
["Direct uit de bron naar een bestand/rapportage",1.5,"Minstens 1 jaar",3,"Minstens iedere dag",3,"Enkele kenmerken in detail",2,"25-40%",3,"Externe data wordt actief gezocht en aangekocht",4,"1 week",3,"Enkele keren per jaar grote incidenten",3,"< 2 weken",3,"25-40% van de vragen",3,"Tijdens de analyse wordt nagedacht hoe resultaten in de praktijk toegepast kunnen worden",3]
["Direct uit meerdere bronnen naar meerdere rapportages",2,"Minstens 5 jaar",4.5,"Minstens iedere week",2,"(Bijna) alle kenmerken geaggregeerd en deel in detail",3,"40-70%",4,"Externe data wordt actief gebruikt",5,"2 weken",2.5,"Enkele keren per maand kleine incidenten",2,"< 1 maand",2,"40-70% van de vragen",4,"Analyse resultaten worden op een standaard manier bruikbaar gemaakt voor praktijk toepassing",4]
["Via een lokaal DWH",3,"Volledige historie",5,"Minstens iedere maand",1.5,"Alle kenmerken op laagste detailniveau",5,"70-100%",5,"Onbekend",1,"1 maand",2,"Wekelijks kleine en grote incidenten",1,"langer",1,"80-100% van de vragen",5,"Analyse resultaten kunnen dezelfde dag in de praktijk worden toegepast",5]
["Via een enterprise DWH of meerdere lokale DWH's",4,null,null,"Op ad hoc basis",1,null,null,null,null,null,null,"meer",1]
["Via een combinatie DWH en data lake",5]
{"$rows_left_out":58}
{"sheet":"Toelichting Werkwijze","index":13,"n_rows":13,"n_cols":1,"rows_kept":13,"cut":false,"hidden":true,"merged":[]}
["Bij de vragen kan een score van 1-5 punten werden behaald."]
["Deze score wordt gewogen"]
["Pas als alle kenmerken gevuld zijn kan naar een volgende pagina worden gebladerd"]
["terugbladeren kan altijd"]
["Als een vraag nog beantwoord moet worden is de tekst rood"]
[]
["Per aspect wordt de totaalscore over alle vragen gedeeld door de weging"]
["Dit levert een score op tussen 1 en 5 die de volwassenheid op dat aspect representeert"]
["Op dezelfde manier wordt een gewogen totale score berekend."]
[]
{"$rows_left_out":3}